Reaction Details
TargetD(2) dopamine receptor
LigandBDBM50132019
Substrate/Competitorn/a
Meas. Tech.ChEMBL_60074 (CHEMBL671730)
Ki 14±n/a nM
Citation Hackling, AGhosh, RPerachon, SMann, AHöltje, HDWermuth, CGSchwartz, JCSippl, WSokoloff, PStark, H N-(omega-(4-(2-methoxyphenyl)piperazin-1-yl)alkyl)carboxamides as dopamine D2 and D3 receptor ligands. J Med Chem46:3883-99 (2003) 
 
D(2) dopamine receptor
Name:D(2) dopamine receptor
Type:Cell-surface receptors
Mol. Mass.:50647.10
Organism:Homo sapiens (Human)
Description:P14416
Residue:443
BDBM50132019
NameBDBM50132019
Synonyms:3-(2-Methoxy-phenyl)-N-{4-[4-(2-methoxy-phenyl)-piperazin-1-yl]-butyl}-acrylamide CHEMBL126441
TypeSmall organic molecule
Emp. Form.C25H33N3O3
Mol. Mass.423.5478
SMILESCOc1ccccc1\C=C\C(=O)NCCCCN1CCN(CC1)c1ccccc1OC