Reaction Details
TargetD(3) dopamine receptor
LigandBDBM50132075
Substrate/Competitorn/a
Meas. Tech.ChEMBL_62137 (CHEMBL675894)
Ki 4.1±n/a nM
Citation Hackling, AGhosh, RPerachon, SMann, AHöltje, HDWermuth, CGSchwartz, JCSippl, WSokoloff, PStark, H N-(omega-(4-(2-methoxyphenyl)piperazin-1-yl)alkyl)carboxamides as dopamine D2 and D3 receptor ligands. J Med Chem46:3883-99 (2003) 
 
D(3) dopamine receptor
Name:D(3) dopamine receptor
Type:n/a
Mol. Mass.:44243.43
Organism:Homo sapiens (Human)
Description:n/a
Residue:400
BDBM50132075
NameBDBM50132075
Synonyms:CHEMBL415520 | N-{4-[4-(2-Methoxy-phenyl)-piperazin-1-yl]-butyl}-3-(3-trifluoromethyl-phenyl)-acrylamide; oxalic acid
TypeSmall organic molecule
Emp. Form.C25H30F3N3O2
Mol. Mass.461.5198
SMILESCOc1ccccc1N1CCN(CCCCNC(=O)\C=C\c2cccc(c2)C(F)(F)F)CC1