Reaction Details
TargetCalcium/calmodulin-dependent protein kinase type II subunit alpha/beta/delta/gamma
LigandBDBM50132310
Substrate/Competitorn/a
Meas. Tech.ChEMBL_43111 (CHEMBL653818)
IC50 780±n/a nM
Citation Zhang, HCWhite, KBYe, HMcComsey, DFDerian, CKAddo, MFAndrade-Gordon, PEckardt, AJConway, BRWestover, LXu, JZLook, RDemarest, KTEmanuel, SMaryanoff, BE Macrocyclic bisindolylmaleimides as inhibitors of protein kinase C and glycogen synthase kinase-3. Bioorg Med Chem Lett13:3049-53 (2003) Calcium/calmodulin-dependent protein kinase type II subunit alpha/beta/delta/gamma
Name:Calcium/calmodulin-dependent protein kinase type II subunit alpha/beta/delta/gamma
Synonyms:CaM kinase II
Type:n/a
Mol. Mass.:n/a
Description:ASSAY_ID of ChEMBL is 368599
Components:This complex has 4 components.
Component 1
Name:Calcium/calmodulin-dependent protein kinase type II subunit alpha
Type:Enzyme Catalytic Domain
Mol. Mass.:54093.63
Organism:Homo sapiens (Human)
Description:gi_25952118
Residue:478
Component 2
Name:Calcium/calmodulin-dependent protein kinase type II subunit gamma
Synonyms:2.7.11.17 CAMK-II CAMKG CaM kinase II gamma CaMK-II subunit gamma Calcium/calmodulin-dependent protein kinase type II subunit gamma (CAMKllg) | KCC2G_HUMAN
Type:Protein
Mol. Mass.:62621.56
Organism:Homo sapiens (Human)
Description:Q13555
Residue:558
Component 3
Name:Calcium/calmodulin-dependent protein kinase type II subunit beta
Synonyms:CAM2 CAMK2B CaM kinase II CaM kinase II subunit beta CaMK-II subunit beta Calcium/calmodulin-dependent protein kinase type II beta chain | KCC2B_HUMAN
Type:Enzyme Catalytic Domain
Mol. Mass.:72685.48
Organism:Homo sapiens (Human)
Description:gi_26051204
Residue:666
Component 4
Name:Calcium/calmodulin-dependent protein kinase type II subunit delta
Synonyms:CAMK2D CaM kinase II CaMK-II subunit delta Calcium/calmodulin-dependent protein kinase type II subunit delta (CAMK2D) KCC2D_HUMAN
Type:Enzyme Catalytic Domain
Mol. Mass.:56419.78
Organism:Homo sapiens (Human)
Description:Q13557
Residue:499
BDBM50132310
NameBDBM50132310
Synonyms:20-ethyl-17,23-dioxa-4,14,20,26-tetraazahexacyclo[24.6.1.17,14.02,6.08,13.027,32]tetratriaconta-1(33),2(6),7(34),8(13),9,11,27(32),28,30-nonaene-3,5-dione | CHEMBL103055
TypeSmall organic molecule
Emp. Form.C30H32N4O4
Mol. Mass.512.5995
SMILESCCN1CCOCCn2cc(C3=C(C(=O)NC3=O)c3cn(CCOCC1)c1ccccc31)c1ccccc21