Reaction Details
TargetProtein kinase C beta type
LigandBDBM50132318
Substrate/Competitorn/a
Meas. Tech.ChEMBL_79564 (CHEMBL686884)
IC50 45.0±n/a nM
Citation Zhang, HCWhite, KBYe, HMcComsey, DFDerian, CKAddo, MFAndrade-Gordon, PEckardt, AJConway, BRWestover, LXu, JZLook, RDemarest, KTEmanuel, SMaryanoff, BE Macrocyclic bisindolylmaleimides as inhibitors of protein kinase C and glycogen synthase kinase-3. Bioorg Med Chem Lett13:3049-53 (2003) Protein kinase C beta type
Name:Protein kinase C beta type
Type:Enzyme
Mol. Mass.:76873.67
Organism:Homo sapiens (Human)
Description:The recombinant human PKC enzymes were produced using a baculovirus expression system in SF9 cells
Residue:671
BDBM50132318
NameBDBM50132318
Synonyms:3-(1-{2-[2-(2-Dimethylamino-ethoxy)-ethoxy]-ethyl}-1H-indol-3-yl)-4-(1-propyl-1H-indol-3-yl)-pyrrole-2,5-dione | CHEMBL321315
TypeSmall organic molecule
Emp. Form.C30H32N4O4
Mol. Mass.512.5995
SMILESCN1CCCn2cc(C3=C(C(=O)NC3=O)c3cn(CCOCCOCC1)c1ccccc31)c1ccccc21