Reaction Details
TargetGlycogen synthase kinase-3 beta
LigandBDBM50132316
Substrate/Competitorn/a
Meas. Tech.ChEBML_71141
IC50 8±n/a nM
Citation Zhang, HCWhite, KBYe, HMcComsey, DFDerian, CKAddo, MFAndrade-Gordon, PEckardt, AJConway, BRWestover, LXu, JZLook, RDemarest, KTEmanuel, SMaryanoff, BE Macrocyclic bisindolylmaleimides as inhibitors of protein kinase C and glycogen synthase kinase-3. Bioorg Med Chem Lett13:3049-53 (2003) Glycogen synthase kinase-3 beta
Name:Glycogen synthase kinase-3 beta
Type:Enzyme
Mol. Mass.:46756.38
Organism:Homo sapiens (Human)
Description:P49841
Residue:420
BDBM50132316
NameBDBM50132316
Synonyms:17,26-dimethyl-20,23-dioxa-4,14,17,26,29-pentaazahexacyclo[27.6.1.17,14.02,6.08,13.030,35]heptatriaconta-1(36),2(6),7(37),8(13),9,11,30(35),31,33-nonaene-3,5-dione | CHEMBL105620
TypeSmall organic molecule
Emp. Form.C32H37N5O4
Mol. Mass.555.6673
SMILESCN1CCOCCOCCN(C)CCn2cc(C3=C(C(=O)NC3=O)c3cn(CC1)c1ccccc31)c1ccccc21