Reaction Details
TargetMitogen-activated protein kinase 1
LigandBDBM50132310
Substrate/Competitorn/a
Meas. Tech.ChEBML_124154
IC50>100000±n/a nM
Citation Zhang, HCWhite, KBYe, HMcComsey, DFDerian, CKAddo, MFAndrade-Gordon, PEckardt, AJConway, BRWestover, LXu, JZLook, RDemarest, KTEmanuel, SMaryanoff, BE Macrocyclic bisindolylmaleimides as inhibitors of protein kinase C and glycogen synthase kinase-3. Bioorg Med Chem Lett13:3049-53 (2003) Mitogen-activated protein kinase 1
Name:Mitogen-activated protein kinase 1
Type:Ser/Thr Protein Kinase
Mol. Mass.:41392.76
Organism:Homo sapiens (Human)
Description:P28482
Residue:360
BDBM50132310
NameBDBM50132310
Synonyms:20-ethyl-17,23-dioxa-4,14,20,26-tetraazahexacyclo[24.6.1.17,14.02,6.08,13.027,32]tetratriaconta-1(33),2(6),7(34),8(13),9,11,27(32),28,30-nonaene-3,5-dione | CHEMBL103055
TypeSmall organic molecule
Emp. Form.C30H32N4O4
Mol. Mass.512.5995
SMILESCCN1CCOCCn2cc(C3=C(C(=O)NC3=O)c3cn(CCOCC1)c1ccccc31)c1ccccc21