Reaction Details
TargetPlatelet-derived growth factor receptor alpha/beta
LigandBDBM50132404
Substrate/Competitorn/a
Meas. Tech.ChEMBL_158496 (CHEMBL765709)
IC50 930±n/a nM
Citation He, WMyers, MRHanney, BSpada, APBilder, GGalzcinski, HAmin, DNeedle, SPage, KJayyosi, ZPerrone, MH Potent quinoxaline-based inhibitors of PDGF receptor tyrosine kinase activity. Part 2: the synthesis and biological activities of RPR127963 an orally bioavailable inhibitor. Bioorg Med Chem Lett13:3097-100 (2003) Platelet-derived growth factor receptor alpha/beta
Name:Platelet-derived growth factor receptor alpha/beta
Type:n/a
Mol. Mass.:n/a
Description:ASSAY_ID of EBI is 29498
Components:This complex has 2 components.
Component 1
Name:Platelet-derived growth factor receptor beta
Synonyms:Beta-type platelet-derived growth factor receptor CD140b antigen PDGF Receptor Substrate PDGFR PDGFR-1 PDGFRB PGFRB_HUMAN Platelet-derived growth factor receptor 1 Platelet-derived growth factor receptor beta (PDGFR-beta) Platelet-derived growth factor receptor beta (PDGFRbeta) | VHL/PDGFRB
Type:Enzyme
Mol. Mass.:123922.25
Organism:Homo sapiens (Human)
Description:P09619
Residue:1106
Component 2
Name:Platelet-derived growth factor receptor alpha
Synonyms:Alpha-type platelet-derived growth factor receptor PDGFRA PGFRA_HUMAN Platelet-derived growth factor receptor alpha (PDGFRA) RHEPDGFRA
Type:Protein
Mol. Mass.:122633.38
Organism:Homo sapiens (Human)
Description:P16234
Residue:1089
BDBM50132404
NameBDBM50132404
Synonyms:4-(6,7-Dimethoxy-quinoxalin-2-ylamino)-cyclohexanecarboxylic acid amide | CHEMBL106878
TypeSmall organic molecule
Emp. Form.C17H22N4O3
Mol. Mass.330.3816
SMILESCOc1cc2ncc(NC3CCC(CC3)C(N)=O)nc2cc1OC