Reaction Details
TargetPlatelet-derived growth factor receptor alpha
LigandBDBM50132391
Substrate/Competitorn/a
Meas. Tech.ChEBML_154718
IC50 299±n/a nM
Citation He, WMyers, MRHanney, BSpada, APBilder, GGalzcinski, HAmin, DNeedle, SPage, KJayyosi, ZPerrone, MH Potent quinoxaline-based inhibitors of PDGF receptor tyrosine kinase activity. Part 2: the synthesis and biological activities of RPR127963 an orally bioavailable inhibitor. Bioorg Med Chem Lett13:3097-100 (2003) Platelet-derived growth factor receptor alpha
Name:Platelet-derived growth factor receptor alpha
Type:Protein
Mol. Mass.:122633.38
Organism:Homo sapiens (Human)
Description:P16234
Residue:1089
BDBM50132391
NameBDBM50132391
Synonyms:4-((R)-6,7-Dimethoxy-quinoxalin-2-ylamino)-cyclohexanol CHEMBL104466 | RP-127963
TypeSmall organic molecule
Emp. Form.C16H21N3O3
Mol. Mass.303.3562
SMILESCOc1cc2ncc(N[C@H]3CC[C@H](O)CC3)nc2cc1OC