Reaction Details
TargetEstrogen receptor
LigandBDBM50133072
Substrate/Competitorn/a
Meas. Tech.ChEMBL_67038 (CHEMBL677876)
Ki 2.2±n/a nM
Citation Minutolo, FAntonello, MBertini, SOrtore, GPlacanica, GRapposelli, SSheng, SCarlson, KEKatzenellenbogen, BSKatzenellenbogen, JAMacchia, M Novel estrogen receptor ligands based on an anthranylaldoxime structure: role of the phenol-type pseudocycle in the binding process. J Med Chem46:4032-42 (2003) 
 
Estrogen receptor
Name:Estrogen receptor
Type:Protein
Mol. Mass.:66230.44
Organism:Homo sapiens (Human)
Description:P03372
Residue:595
BDBM50133072
NameBDBM50133072
Synonyms:3'-Amino-[1,1';2',1'']terphenyl-4'-carbaldehyde oxime | CHEMBL131163
TypeSmall organic molecule
Emp. Form.C19H16N2O
Mol. Mass.288.3431
SMILESNc1c(CN=O)ccc(-c2ccccc2)c1-c1ccccc1