Reaction Details
TargetGonadotropin-releasing hormone receptor
LigandBDBM50133853
Substrate/Competitorn/a
Meas. Tech.ChEBML_71591
Ki 360±n/a nM
Citation Guo, ZChen, YWu, DZhu, YFStruthers, RSSaunders, JXie, QChen, C Synthesis and structure-activity relationships of thieno[2,3-d]pyrimidine-2,4-dione derivatives as potent GnRH receptor antagonists. Bioorg Med Chem Lett13:3617-22 (2003) Gonadotropin-releasing hormone receptor
Name:Gonadotropin-releasing hormone receptor
Type:Enzyme
Mol. Mass.:37749.45
Organism:Homo sapiens (Human)
Description:P30968
Residue:328
BDBM50133853
NameBDBM50133853
Synonyms:3-Amino-N-{4-[5-[(benzyl-methyl-amino)-methyl]-1-(2,6-difluoro-benzyl)-2,4-dioxo-3-phenyl-1,2,3,4-tetrahydro-thieno[2,3-d]pyrimidin-6-yl]-phenyl}-propionamide | CHEMBL334148
TypeSmall organic molecule
Emp. Form.C37H33F2N5O3S
Mol. Mass.665.751
SMILESCN(Cc1c(sc2n(Cc3c(F)cccc3F)c(=O)n(-c3ccccc3)c(=O)c12)-c1ccc(NC(=O)CCN)cc1)Cc1ccccc1