Reaction Details
TargetGonadotropin-releasing hormone receptor
LigandBDBM50067485
Substrate/Competitorn/a
Meas. Tech.ChEBML_71746
Ki 60±n/a nM
Citation Guo, ZChen, YWu, DZhu, YFStruthers, RSSaunders, JXie, QChen, C Synthesis and structure-activity relationships of thieno[2,3-d]pyrimidine-2,4-dione derivatives as potent GnRH receptor antagonists. Bioorg Med Chem Lett13:3617-22 (2003) Gonadotropin-releasing hormone receptor
Name:Gonadotropin-releasing hormone receptor
Type:PROTEIN
Mol. Mass.:37767.60
Organism:Rattus norvegicus
Description:ChEMBL_1335047
Residue:327
BDBM50067485
NameBDBM50067485
Synonyms:3-[(Benzyl-methyl-amino)-methyl]-7-(2,6-difluoro-benzyl)-2-(4-isobutyrylamino-phenyl)-4-oxo-4,7-dihydro-thieno[2,3-b]pyridine-5-carboxylic acid isopropyl ester; hydrochloride CHEMBL71917 | T-98475
TypeSmall organic molecule
Emp. Form.C37H37F2N3O4S
Mol. Mass.657.769
SMILESCC(C)OC(=O)c1cn(Cc2c(F)cccc2F)c2sc(c(CN(C)Cc3ccccc3)c2c1=O)-c1ccc(NC(=O)C(C)C)cc1