Reaction Details
TargetPhospho-N-acetylmuramoyl-pentapeptide-transferase
LigandBDBM50221211
Substrate/Competitorn/a
Meas. Tech.ChEMBL_208264 (CHEMBL813224)
IC50 12.2±n/a nM
Citation Hotoda, HFurukawa, MDaigo, MMurayama, KKaneko, MMuramatsu, YIshii, MMMiyakoshi, STakatsu, TInukai, MKakuta, MAbe, THarasaki, TFukuoka, TUtsui, YOhya, S Synthesis and antimycobacterial activity of capuramycin analogues. Part 1: substitution of the azepan-2-one moiety of capuramycin. Bioorg Med Chem Lett13:2829-32 (2003) Phospho-N-acetylmuramoyl-pentapeptide-transferase
Name:Phospho-N-acetylmuramoyl-pentapeptide-transferase
Type:PROTEIN
Mol. Mass.:39889.38
Organism:Escherichia coli (strain K12)
Description:ChEMBL_1454117
Residue:360
BDBM50221211
NameBDBM50221211
Synonyms:CHEMBL97077
TypeSmall organic molecule
Emp. Form.C23H26N4O11
Mol. Mass.534.4727
SMILES[H][C@@]1(O[C@H]([C@H](O)[C@@H]1OC)n1ccc(=O)[nH]c1=O)[C@@H](O[C@H]1OC(=C[C@H](O)[C@@H]1O)C(=O)Nc1ccccc1)C(N)=O