Reaction Details
TargetGenome polyprotein
LigandBDBM50136007
Substrate/Competitorn/a
Meas. Tech.ChEMBL_158779 (CHEMBL772935)
Ki 500±n/a nM
Citation Guo, ZDurkin, JFischmann, TIngram, RProngay, AZhang, RMadison, V Application of the lambda-dynamics method to evaluate the relative binding free energies of inhibitors to HCV protease. J Med Chem46:5360-4 (2003) 
 
Genome polyprotein
Name:Genome polyprotein
Type:PROTEIN
Mol. Mass.:44361.04
Organism:Human rhinovirus B
Description:ChEMBL_158953
Residue:401
BDBM50136007
NameBDBM50136007
Synonyms:(S)-4-((S)-2-Acetylamino-3-carboxy-propionylamino)-4-((R)-(S)-1-{1-[(R)-(R)-1-((S)-1-carboxy-2-methylsulfanyl-ethylcarbamoyl)-2-cyclohexyl-ethylcarbamoyl]-2-methyl-butylcarbamoyl}-3-methyl-butylcarbamoyl)-butyric acid | CHEMBL356369
TypeSmall organic molecule
Emp. Form.C36H60N6O12S
Mol. Mass.800.96
SMILESCC[C@@H](C)[C@H](NC(=O)[C@H](CC(C)C)NC(=O)[C@@H](CCC(O)=O)NC(=O)[C@H](CC(O)=O)NC(C)=O)C(=O)N[C@@H](CC1CCCCC1)C(=O)N[C@@H](CSC)C(O)=O