Reaction Details
TargetMitogen-activated protein kinase kinase kinase 20
LigandBDBM50571440
Substrate/Competitorn/a
Meas. Tech.ChEMBL_2114684 (CHEMBL4823625)
IC50>100±n/a nM
Citation Zhang, HPeng, XDai, YShao, JJi, YSun, YLiu, BCheng, XAi, JDuan, W Discovery of a Pyrimidinedione Derivative as a Potent and Orally Bioavailable Axl Inhibitor. J Med Chem64:3956-3975 (2021) 
 
Mitogen-activated protein kinase kinase kinase 20
Name:Mitogen-activated protein kinase kinase kinase 20
Type:PROTEIN
Mol. Mass.:91168.58
Organism:Homo sapiens (Human)
Description:ChEMBL_1495629
Residue:800
BDBM50571440
NameBDBM50571440
Synonyms:CHEMBL4873571
TypeSmall organic molecule
Emp. Form.C29H25F2N5O5
Mol. Mass.561.5361
SMILESCC(C)n1cc(C(=O)Nc2ccc(Oc3ccnc(NC(=O)C4CC4)c3)c(F)c2)c(=O)n(-c2ccc(F)cc2)c1=O