Reaction Details
TargetOrexin receptor type 2
LigandBDBM50136699
Substrate/Competitorn/a
Meas. Tech.ChEBML_147798
IC50 25±n/a nM
Citation Hirose, MEgashira, SGoto, YHashihayata, TOhtake, NIwaasa, HHata, MFukami, TKanatani, AYamada, K N-acyl 6,7-dimethoxy-1,2,3,4-tetrahydroisoquinoline: the first orexin-2 receptor selective non-peptidic antagonist. Bioorg Med Chem Lett13:4497-9 (2003) Orexin receptor type 2
Name:Orexin receptor type 2
Type:Protein
Mol. Mass.:50710.53
Organism:Homo sapiens (Human)
Description:O43614
Residue:444
BDBM50136699
NameBDBM50136699
Synonyms:(S)-1-(6,7-Dimethoxy-3,4-dihydro-1H-isoquinolin-2-yl)-3,3-dimethyl-2-[(thiophen-2-ylmethyl)-amino]-butan-1-one CHEMBL344622
TypeSmall organic molecule
Emp. Form.C22H30N2O3S
Mol. Mass.402.55
SMILESCOc1cc2CCN(Cc2cc1OC)C(=O)[C@@H](NCc1cccs1)C(C)(C)C