Reaction Details
TargetOrexin receptor type 2
LigandBDBM50136704
Substrate/Competitorn/a
Meas. Tech.ChEBML_147798
IC50 2100±n/a nM
Citation Hirose, MEgashira, SGoto, YHashihayata, TOhtake, NIwaasa, HHata, MFukami, TKanatani, AYamada, K N-acyl 6,7-dimethoxy-1,2,3,4-tetrahydroisoquinoline: the first orexin-2 receptor selective non-peptidic antagonist. Bioorg Med Chem Lett13:4497-9 (2003) Orexin receptor type 2
Name:Orexin receptor type 2
Type:Protein
Mol. Mass.:50710.53
Organism:Homo sapiens (Human)
Description:O43614
Residue:444
BDBM50136704
NameBDBM50136704
Synonyms:(+/-)-1-(6,7-dimethoxy-3,4-dihydroisoquinolin-2(1H)-yl)-3,3-dimethyl-2-(phenylamino)butan-1-one CHEMBL139117
TypeSmall organic molecule
Emp. Form.C23H30N2O3
Mol. Mass.382.4959
SMILESCOc1cc2CCN(Cc2cc1OC)C(=O)C(Nc1ccccc1)C(C)(C)C