Reaction Details
TargetOrexin/Hypocretin receptor type 1
LigandBDBM50136712
Substrate/Competitorn/a
Meas. Tech.ChEBML_147674
IC50>10000±n/a nM
Citation Hirose, MEgashira, SGoto, YHashihayata, TOhtake, NIwaasa, HHata, MFukami, TKanatani, AYamada, K N-acyl 6,7-dimethoxy-1,2,3,4-tetrahydroisoquinoline: the first orexin-2 receptor selective non-peptidic antagonist. Bioorg Med Chem Lett13:4497-9 (2003) Orexin/Hypocretin receptor type 1
Name:Orexin/Hypocretin receptor type 1
Type:Protein
Mol. Mass.:47554.50
Organism:Homo sapiens (Human)
Description:O43613
Residue:425
BDBM50136712
NameBDBM50136712
Synonyms:(+/-)-1-(6,7-dimethoxy-3,4-dihydroisoquinolin-2(1H)-yl)-2-(dimethylamino)-3-phenylpropan-1-one CHEMBL342039
TypeSmall organic molecule
Emp. Form.C22H28N2O3
Mol. Mass.368.4693
SMILESCOc1cc2CCN(Cc2cc1OC)C(=O)C(Cc1ccccc1)N(C)C