Reaction Details
TargetOrexin receptor type 2
LigandBDBM50136719
Substrate/Competitorn/a
Meas. Tech.ChEBML_147798
IC50 240±n/a nM
Citation Hirose, MEgashira, SGoto, YHashihayata, TOhtake, NIwaasa, HHata, MFukami, TKanatani, AYamada, K N-acyl 6,7-dimethoxy-1,2,3,4-tetrahydroisoquinoline: the first orexin-2 receptor selective non-peptidic antagonist. Bioorg Med Chem Lett13:4497-9 (2003) Orexin receptor type 2
Name:Orexin receptor type 2
Type:Protein
Mol. Mass.:50710.53
Organism:Homo sapiens (Human)
Description:O43614
Residue:444
BDBM50136719
NameBDBM50136719
Synonyms:(S)-1-(6,7-Dimethoxy-3,4-dihydro-1H-isoquinolin-2-yl)-3,3-dimethyl-2-[(pyridin-3-ylmethyl)-amino]-butan-1-one CHEMBL139634
TypeSmall organic molecule
Emp. Form.C23H31N3O3
Mol. Mass.397.5105
SMILESCOc1cc2CCN(Cc2cc1OC)C(=O)[C@@H](NCc1cccnc1)C(C)(C)C