Reaction Details
TargetDipeptidyl peptidase 2
LigandBDBM50137244
Substrate/Competitorn/a
Meas. Tech.ChEMBL_160557 (CHEMBL763144)
IC50 18.0±n/a nM
Citation Parmee, ERHe, JMastracchio, AEdmondson, SDColwell, LEiermann, GFeeney, WPHabulihaz, BHe, HKilburn, RLeiting, BLyons, KMarsilio, FPatel, RAPetrov, ADi Salvo, JWu, JKThornberry, NAWeber, AE 4-Amino cyclohexylglycine analogues as potent dipeptidyl peptidase IV inhibitors. Bioorg Med Chem Lett14:43-6 (2003) Dipeptidyl peptidase 2
Name:Dipeptidyl peptidase 2
Type:Protein
Mol. Mass.:54339.29
Organism:Homo sapiens (Human)
Description:Q9UHL4
Residue:492
BDBM50137244
NameBDBM50137244
Synonyms:CHEMBL3084942 | Naphthalene-2-sulfonic acid [4-((S)-1-amino-2-oxo-2-thiazolidin-3-yl-ethyl)-cyclohexyl]-amide
TypeSmall organic molecule
Emp. Form.C21H27N3O3S2
Mol. Mass.433.587
SMILES[H][C@@]1(CC[C@@H](CC1)NS(=O)(=O)c1ccc2ccccc2c1)[C@H](N)C(=O)N1CCSC1