Reaction Details
TargetDipeptidyl peptidase 2
LigandBDBM50137246
Substrate/Competitorn/a
Meas. Tech.ChEMBL_160557 (CHEMBL763144)
IC50 29.0±n/a nM
Citation Parmee, ERHe, JMastracchio, AEdmondson, SDColwell, LEiermann, GFeeney, WPHabulihaz, BHe, HKilburn, RLeiting, BLyons, KMarsilio, FPatel, RAPetrov, ADi Salvo, JWu, JKThornberry, NAWeber, AE 4-Amino cyclohexylglycine analogues as potent dipeptidyl peptidase IV inhibitors. Bioorg Med Chem Lett14:43-6 (2003) Dipeptidyl peptidase 2
Name:Dipeptidyl peptidase 2
Type:Protein
Mol. Mass.:54339.29
Organism:Homo sapiens (Human)
Description:Q9UHL4
Residue:492
BDBM50137246
NameBDBM50137246
Synonyms:CHEMBL3084950 | [4-((S)-1-Amino-2-oxo-2-thiazolidin-3-yl-ethyl)-cyclohexyl]-carbamic acid 3,4-dichloro-benzyl ester
TypeSmall organic molecule
Emp. Form.C19H25Cl2N3O3S
Mol. Mass.446.391
SMILES[H][C@@]1(CC[C@@H](CC1)NC(=O)OCc1ccc(Cl)c(Cl)c1)[C@H](N)C(=O)N1CCSC1