Reaction Details
TargetDipeptidyl peptidase 4
LigandBDBM50137252
Substrate/Competitorn/a
Meas. Tech.ChEBML_53362
IC50 960±n/a nM
Citation Parmee, ERHe, JMastracchio, AEdmondson, SDColwell, LEiermann, GFeeney, WPHabulihaz, BHe, HKilburn, RLeiting, BLyons, KMarsilio, FPatel, RAPetrov, ADi Salvo, JWu, JKThornberry, NAWeber, AE 4-Amino cyclohexylglycine analogues as potent dipeptidyl peptidase IV inhibitors. Bioorg Med Chem Lett14:43-6 (2003) Dipeptidyl peptidase 4
Name:Dipeptidyl peptidase 4
Type:Enzyme
Mol. Mass.:88271.01
Organism:Homo sapiens (Human)
Description:P27487
Residue:766
BDBM50137252
NameBDBM50137252
Synonyms:CHEMBL3084943 | N-[4-((S)-1-Amino-2-oxo-2-thiazolidin-3-yl-ethyl)-cyclohexyl]-2,3,4-trifluoro-benzenesulfonamide
TypeSmall organic molecule
Emp. Form.C17H22F3N3O3S2
Mol. Mass.437.5
SMILES[H][C@@]1(CC[C@@H](CC1)NS(=O)(=O)c1ccc(F)c(F)c1F)[C@H](N)C(=O)N1CCSC1