Reaction Details
TargetDipeptidyl peptidase 4
LigandBDBM50137255
Substrate/Competitorn/a
Meas. Tech.ChEBML_53362
IC50 64±n/a nM
Citation Parmee, ERHe, JMastracchio, AEdmondson, SDColwell, LEiermann, GFeeney, WPHabulihaz, BHe, HKilburn, RLeiting, BLyons, KMarsilio, FPatel, RAPetrov, ADi Salvo, JWu, JKThornberry, NAWeber, AE 4-Amino cyclohexylglycine analogues as potent dipeptidyl peptidase IV inhibitors. Bioorg Med Chem Lett14:43-6 (2003) Dipeptidyl peptidase 4
Name:Dipeptidyl peptidase 4
Type:Enzyme
Mol. Mass.:88271.01
Organism:Homo sapiens (Human)
Description:P27487
Residue:766
BDBM50137255
NameBDBM50137255
Synonyms:CHEMBL3084940 | Isoquinoline-4-carboxylic acid [4-((S)-1-amino-2-oxo-2-pyrrolidin-1-yl-ethyl)-cyclohexyl]-amide
TypeSmall organic molecule
Emp. Form.C22H28N4O2
Mol. Mass.380.4833
SMILES[H][C@@]1(CC[C@@H](CC1)NC(=O)c1cncc2ccccc12)[C@H](N)C(=O)N1CCCC1