Reaction Details
TargetDipeptidyl peptidase 2
LigandBDBM50137261
Substrate/Competitorn/a
Meas. Tech.ChEMBL_160557 (CHEMBL763144)
IC50 1100±n/a nM
Citation Parmee, ERHe, JMastracchio, AEdmondson, SDColwell, LEiermann, GFeeney, WPHabulihaz, BHe, HKilburn, RLeiting, BLyons, KMarsilio, FPatel, RAPetrov, ADi Salvo, JWu, JKThornberry, NAWeber, AE 4-Amino cyclohexylglycine analogues as potent dipeptidyl peptidase IV inhibitors. Bioorg Med Chem Lett14:43-6 (2003) Dipeptidyl peptidase 2
Name:Dipeptidyl peptidase 2
Type:Protein
Mol. Mass.:54339.29
Organism:Homo sapiens (Human)
Description:Q9UHL4
Residue:492
BDBM50137261
NameBDBM50137261
Synonyms:CHEMBL25211 | N-[4-((S)-1-Amino-2-oxo-2-thiazolidin-3-yl-ethyl)-cyclohexyl]-4-trifluoromethoxy-benzenesulfonamide
TypeSmall organic molecule
Emp. Form.C18H24F3N3O4S2
Mol. Mass.467.526
SMILES[H][C@@]1(CC[C@@H](CC1)NS(=O)(=O)c1ccc(OC(F)(F)F)cc1)[C@H](N)C(=O)N1CCSC1