Reaction Details
TargetDipeptidyl peptidase 4
LigandBDBM50137265
Substrate/Competitorn/a
Meas. Tech.ChEBML_53362
IC50 17±n/a nM
Citation Parmee, ERHe, JMastracchio, AEdmondson, SDColwell, LEiermann, GFeeney, WPHabulihaz, BHe, HKilburn, RLeiting, BLyons, KMarsilio, FPatel, RAPetrov, ADi Salvo, JWu, JKThornberry, NAWeber, AE 4-Amino cyclohexylglycine analogues as potent dipeptidyl peptidase IV inhibitors. Bioorg Med Chem Lett14:43-6 (2003) Dipeptidyl peptidase 4
Name:Dipeptidyl peptidase 4
Type:Enzyme
Mol. Mass.:88271.01
Organism:Homo sapiens (Human)
Description:P27487
Residue:766
BDBM50137265
NameBDBM50137265
Synonyms:1-[4-((S)-1-Amino-2-oxo-2-thiazolidin-3-yl-ethyl)-cyclohexyl]-3-(3,4-dichloro-phenyl)-urea | CHEMBL3084954
TypeSmall organic molecule
Emp. Form.C18H24Cl2N4O2S
Mol. Mass.431.38
SMILES[H][C@@]1(CC[C@@H](CC1)NC(=O)Nc1ccc(Cl)c(Cl)c1)[C@H](N)C(=O)N1CCSC1