Reaction Details
TargetDipeptidyl peptidase 2
LigandBDBM50137263
Substrate/Competitorn/a
Meas. Tech.ChEMBL_160557 (CHEMBL763144)
IC50 230±n/a nM
Citation Parmee, ERHe, JMastracchio, AEdmondson, SDColwell, LEiermann, GFeeney, WPHabulihaz, BHe, HKilburn, RLeiting, BLyons, KMarsilio, FPatel, RAPetrov, ADi Salvo, JWu, JKThornberry, NAWeber, AE 4-Amino cyclohexylglycine analogues as potent dipeptidyl peptidase IV inhibitors. Bioorg Med Chem Lett14:43-6 (2003) Dipeptidyl peptidase 2
Name:Dipeptidyl peptidase 2
Type:Protein
Mol. Mass.:54339.29
Organism:Homo sapiens (Human)
Description:Q9UHL4
Residue:492
BDBM50137263
NameBDBM50137263
Synonyms:CHEMBL3084946 | N-[4-((S)-1-Amino-2-oxo-2-thiazolidin-3-yl-ethyl)-cyclohexyl]-3,4-dichloro-benzamide
TypeSmall organic molecule
Emp. Form.C18H23Cl2N3O2S
Mol. Mass.416.365
SMILES[H][C@@]1(CC[C@@H](CC1)NC(=O)c1ccc(Cl)c(Cl)c1)[C@H](N)C(=O)N1CCSC1