Reaction Details
TargetDipeptidyl peptidase 4
LigandBDBM50137272
Substrate/Competitorn/a
Meas. Tech.ChEBML_53362
IC50 46±n/a nM
Citation Parmee, ERHe, JMastracchio, AEdmondson, SDColwell, LEiermann, GFeeney, WPHabulihaz, BHe, HKilburn, RLeiting, BLyons, KMarsilio, FPatel, RAPetrov, ADi Salvo, JWu, JKThornberry, NAWeber, AE 4-Amino cyclohexylglycine analogues as potent dipeptidyl peptidase IV inhibitors. Bioorg Med Chem Lett14:43-6 (2003) Dipeptidyl peptidase 4
Name:Dipeptidyl peptidase 4
Type:Enzyme
Mol. Mass.:88271.01
Organism:Homo sapiens (Human)
Description:P27487
Residue:766
BDBM50137272
NameBDBM50137272
Synonyms:CHEMBL3084944 | Naphthalene-1-carboxylic acid [4-((S)-1-amino-2-oxo-2-pyrrolidin-1-yl-ethyl)-cyclohexyl]-amide
TypeSmall organic molecule
Emp. Form.C23H29N3O2
Mol. Mass.379.4953
SMILES[H][C@@]1(CC[C@@H](CC1)NC(=O)c1cccc2ccccc12)[C@H](N)C(=O)N1CCCC1