Reaction Details
Target5-hydroxytryptamine receptor 1F
LigandBDBM50130443
Substrate/Competitorn/a
Meas. Tech.ChEBML_2086
Ki 7.6±n/a nM
Citation Mathes, BMHudziak, KJSchaus, JMXu, YCNelson, DLWainscott, DBNutter, SEGough, WHBranchek, TAZgombick, JMFilla, SA Substituted furo[3,2-b]pyridines: novel bioisosteres of 5-HT 1F receptor agonists. Bioorg Med Chem Lett14:167-70 (2003) 5-hydroxytryptamine receptor 1F
Name:5-hydroxytryptamine receptor 1F
Type:Enzyme Catalytic Domain
Mol. Mass.:41724.68
Organism:Homo sapiens (Human)
Description:5-HT1F HTR1F HUMAN::P30939
Residue:366
BDBM50130443
NameBDBM50130443
Synonyms:4-Fluoro-N-[3-(1-methyl-piperidin-4-yl)-1H-pyrrolo[3,2-b]pyridin-5-yl]-benzamide | CHEMBL103479
TypeSmall organic molecule
Emp. Form.C20H21FN4O
Mol. Mass.352.4053
SMILESCN1CCC(CC1)c1c[nH]c2ccc(NC(=O)c3ccc(F)cc3)nc12