Reaction Details
Target5-hydroxytryptamine receptor 1F
LigandBDBM50137542
Substrate/Competitorn/a
Meas. Tech.ChEBML_2086
Ki 8.2±n/a nM
Citation Mathes, BMHudziak, KJSchaus, JMXu, YCNelson, DLWainscott, DBNutter, SEGough, WHBranchek, TAZgombick, JMFilla, SA Substituted furo[3,2-b]pyridines: novel bioisosteres of 5-HT 1F receptor agonists. Bioorg Med Chem Lett14:167-70 (2003) 5-hydroxytryptamine receptor 1F
Name:5-hydroxytryptamine receptor 1F
Type:Enzyme Catalytic Domain
Mol. Mass.:41724.68
Organism:Homo sapiens (Human)
Description:5-HT1F HTR1F HUMAN::P30939
Residue:366
BDBM50137542
NameBDBM50137542
Synonyms:CHEMBL178066 | N-[3-(2-Dimethylamino-ethyl)-2-methyl-1H-indol-5-yl]-4-fluoro-benzamide
TypeSmall organic molecule
Emp. Form.C20H22FN3O
Mol. Mass.339.4066
SMILESCN(C)CCc1c(C)[nH]c2ccc(NC(=O)c3ccc(F)cc3)cc12