Reaction Details
TargetProto-oncogene tyrosine-protein kinase Src
LigandBDBM50137584
Substrate/Competitorn/a
Meas. Tech.ChEBML_202627
IC50 60±n/a nM
Citation Guan, HLaird, ADBlake, RATang, CLiang, C Design and synthesis of aminopropyl tetrahydroindole-based indolin-2-ones as selective and potent inhibitors of Src and Yes tyrosine kinase. Bioorg Med Chem Lett14:187-90 (2003) Proto-oncogene tyrosine-protein kinase Src
Name:Proto-oncogene tyrosine-protein kinase Src
Type:Protein
Mol. Mass.:59838.60
Organism:Homo sapiens (Human)
Description:P12931
Residue:536
BDBM50137584
NameBDBM50137584
Synonyms:3-[1-[3-(3-Dimethylamino-propyl)-4,5,6,7-tetrahydro-1H-indol-2-yl]-meth-(Z)-ylidene]-5-ethanesulfonyl-1,3-dihydro-indol-2-one | CHEMBL59042
TypeSmall organic molecule
Emp. Form.C24H31N3O3S
Mol. Mass.441.586
SMILESCCS(=O)(=O)c1ccc2NC(=O)\C(=C/c3[nH]c4CCCCc4c3CCCN(C)C)c2c1