Reaction Details
TargetPlatelet-derived growth factor receptor beta
LigandBDBM50137581
Substrate/Competitorn/a
Meas. Tech.ChEBML_152452
IC50 2300±n/a nM
Citation Guan, HLaird, ADBlake, RATang, CLiang, C Design and synthesis of aminopropyl tetrahydroindole-based indolin-2-ones as selective and potent inhibitors of Src and Yes tyrosine kinase. Bioorg Med Chem Lett14:187-90 (2003) Platelet-derived growth factor receptor beta
Name:Platelet-derived growth factor receptor beta
Type:Enzyme
Mol. Mass.:123922.25
Organism:Homo sapiens (Human)
Description:P09619
Residue:1106
BDBM50137581
NameBDBM50137581
Synonyms:5-Ethanesulfonyl-3-[1-{3-[3-(4-hydroxy-piperidin-1-yl)-propyl]-4,5,6,7-tetrahydro-1H-indol-2-yl}-meth-(Z)-ylidene]-1,3-dihydro-indol-2-one | CHEMBL298566
TypeSmall organic molecule
Emp. Form.C27H35N3O4S
Mol. Mass.497.65
SMILESCCS(=O)(=O)c1ccc2NC(=O)\C(=C/c3[nH]c4CCCCc4c3CCCN3CCC(O)CC3)c2c1