Reaction Details
TargetFibroblast growth factor receptor 1
LigandBDBM50137587
Substrate/Competitorn/a
Meas. Tech.ChEBML_70625
IC50 200±n/a nM
Citation Guan, HLaird, ADBlake, RATang, CLiang, C Design and synthesis of aminopropyl tetrahydroindole-based indolin-2-ones as selective and potent inhibitors of Src and Yes tyrosine kinase. Bioorg Med Chem Lett14:187-90 (2003) Fibroblast growth factor receptor 1
Name:Fibroblast growth factor receptor 1
Type:Receptor
Mol. Mass.:91861.70
Organism:Homo sapiens (Human)
Description:P11362
Residue:822
BDBM50137587
NameBDBM50137587
Synonyms:3-[1-(3-Morpholin-4-ylmethyl-4,5,6,7-tetrahydro-1H-indol-2-yl)-meth-(Z)-ylidene]-2-oxo-2,3-dihydro-1H-indole-5-sulfonic acid methylamide | CHEMBL301143
TypeSmall organic molecule
Emp. Form.C23H28N4O4S
Mol. Mass.456.558
SMILESCNS(=O)(=O)c1ccc2NC(=O)\C(=C/c3[nH]c4CCCCc4c3CN3CCOCC3)c2c1