Reaction Details
TargetVascular endothelial growth factor receptor 2
LigandBDBM50137591
Substrate/Competitorn/a
Meas. Tech.ChEBML_214117
IC50 400±n/a nM
Citation Guan, HLaird, ADBlake, RATang, CLiang, C Design and synthesis of aminopropyl tetrahydroindole-based indolin-2-ones as selective and potent inhibitors of Src and Yes tyrosine kinase. Bioorg Med Chem Lett14:187-90 (2003) Vascular endothelial growth factor receptor 2
Name:Vascular endothelial growth factor receptor 2
Type:Receptor Tyrosine Kinase
Mol. Mass.:151510.97
Organism:Homo sapiens (Human)
Description:P35968
Residue:1356
BDBM50137591
NameBDBM50137591
Synonyms:5-Ethanesulfonyl-3-[1-(3-{3-[4-(2-hydroxy-ethyl)-piperazin-1-yl]-propyl}-4,5,6,7-tetrahydro-1H-indol-2-yl)-meth-(Z)-ylidene]-1,3-dihydro-indol-2-one | CHEMBL57143
TypeSmall organic molecule
Emp. Form.C28H38N4O4S
Mol. Mass.526.691
SMILESCCS(=O)(=O)c1ccc2NC(=O)\C(=C/c3[nH]c4CCCCc4c3CCCN3CCN(CCO)CC3)c2c1