Reaction Details
TargetProto-oncogene tyrosine-protein kinase Src
LigandBDBM50137597
Substrate/Competitorn/a
Meas. Tech.ChEBML_202627
IC50 3300±n/a nM
Citation Guan, HLaird, ADBlake, RATang, CLiang, C Design and synthesis of aminopropyl tetrahydroindole-based indolin-2-ones as selective and potent inhibitors of Src and Yes tyrosine kinase. Bioorg Med Chem Lett14:187-90 (2003) Proto-oncogene tyrosine-protein kinase Src
Name:Proto-oncogene tyrosine-protein kinase Src
Type:Protein
Mol. Mass.:59838.60
Organism:Homo sapiens (Human)
Description:P12931
Residue:536
BDBM50137597
NameBDBM50137597
Synonyms:3-[1-[3-(3-Dimethylamino-propyl)-4,5,6,7-tetrahydro-1H-indol-2-yl]-meth-(Z)-ylidene]-1,3-dihydro-indol-2-one | CHEMBL418274
TypeSmall organic molecule
Emp. Form.C22H27N3O
Mol. Mass.349.4693
SMILESCN(C)CCCc1c(\C=C2/C(=O)Nc3ccccc23)[nH]c2CCCCc12