Reaction Details
TargetProto-oncogene tyrosine-protein kinase Src
LigandBDBM50137601
Substrate/Competitorn/a
Meas. Tech.ChEBML_202627
IC50 240±n/a nM
Citation Guan, HLaird, ADBlake, RATang, CLiang, C Design and synthesis of aminopropyl tetrahydroindole-based indolin-2-ones as selective and potent inhibitors of Src and Yes tyrosine kinase. Bioorg Med Chem Lett14:187-90 (2003) Proto-oncogene tyrosine-protein kinase Src
Name:Proto-oncogene tyrosine-protein kinase Src
Type:Protein
Mol. Mass.:59838.60
Organism:Homo sapiens (Human)
Description:P12931
Residue:536
BDBM50137601
NameBDBM50137601
Synonyms:3-[1-[3-(3-Dimethylamino-propyl)-4,5,6,7-tetrahydro-1H-indol-2-yl]-meth-(Z)-ylidene]-2-oxo-2,3-dihydro-1H-indole-5-sulfonic acid (2-hydroxy-ethyl)-amide | CHEMBL54574
TypeSmall organic molecule
Emp. Form.C24H32N4O4S
Mol. Mass.472.6
SMILESCN(C)CCCc1c2CCCCc2[nH]c1\C=C1/C(=O)Nc2ccc(cc12)S(=O)(=O)NCCO