Reaction Details
TargetTyrosine-protein kinase Lck
LigandBDBM50137585
Substrate/Competitorn/a
Meas. Tech.ChEBML_96912
IC50 800±n/a nM
Citation Guan, HLaird, ADBlake, RATang, CLiang, C Design and synthesis of aminopropyl tetrahydroindole-based indolin-2-ones as selective and potent inhibitors of Src and Yes tyrosine kinase. Bioorg Med Chem Lett14:187-90 (2003) Tyrosine-protein kinase Lck
Name:Tyrosine-protein kinase Lck
Type:n/a
Mol. Mass.:57987.83
Organism:Homo sapiens (Human)
Description:P06239
Residue:509
BDBM50137585
NameBDBM50137585
Synonyms:5-Ethanesulfonyl-3-[1-(3-morpholin-4-ylmethyl-4,5,6,7-tetrahydro-1H-indol-2-yl)-meth-(Z)-ylidene]-1,3-dihydro-indol-2-one | CHEMBL55594
TypeSmall organic molecule
Emp. Form.C24H29N3O4S
Mol. Mass.455.57
SMILESCCS(=O)(=O)c1ccc2NC(=O)\C(=C/c3[nH]c4CCCCc4c3CN3CCOCC3)c2c1