Reaction Details
TargetVascular endothelial growth factor receptor 2
LigandBDBM50137578
Substrate/Competitorn/a
Meas. Tech.ChEBML_214117
IC50 800±n/a nM
Citation Guan, HLaird, ADBlake, RATang, CLiang, C Design and synthesis of aminopropyl tetrahydroindole-based indolin-2-ones as selective and potent inhibitors of Src and Yes tyrosine kinase. Bioorg Med Chem Lett14:187-90 (2003) Vascular endothelial growth factor receptor 2
Name:Vascular endothelial growth factor receptor 2
Type:Receptor Tyrosine Kinase
Mol. Mass.:151510.97
Organism:Homo sapiens (Human)
Description:P35968
Residue:1356
BDBM50137578
NameBDBM50137578
Synonyms:CHEMBL300853 | [4-(3-{2-[5-Ethanesulfonyl-2-oxo-1,2-dihydro-indol-(3Z)-ylidenemethyl]-4,5,6,7-tetrahydro-1H-indol-3-yl}-propyl)-piperazin-1-yl]-acetic acid
TypeSmall organic molecule
Emp. Form.C28H36N4O5S
Mol. Mass.540.674
SMILESCCS(=O)(=O)c1ccc2NC(=O)\C(=C/c3[nH]c4CCCCc4c3CCCN3CCN(CC(O)=O)CC3)c2c1