Reaction Details
TargetPeroxisomal acyl-coenzyme A oxidase 1
LigandBDBM50138599
Substrate/Competitorn/a
Meas. Tech.ChEBML_154606
IC50 2500±n/a nM
Citation Koltun, DOMarquart, TAShenk, KDElzein, ELi, YNguyen, MKerwar, SZeng, DChu, NSoohoo, DHao, JMaydanik, VYLustig, DANg, KJFraser, HZablocki, JA New fatty acid oxidation inhibitors with increased potency lacking adverse metabolic and electrophysiological properties. Bioorg Med Chem Lett14:549-52 (2003) Peroxisomal acyl-coenzyme A oxidase 1
Name:Peroxisomal acyl-coenzyme A oxidase 1
Type:PROTEIN
Mol. Mass.:74693.04
Organism:Rattus norvegicus
Description:ChEMBL_311972
Residue:661
BDBM50138599
NameBDBM50138599
Synonyms:CHEMBL154751 | N-(2,6-Dimethyl-phenyl)-2-{4-[(R)-2-hydroxy-3-(2-methyl-benzothiazol-5-yloxy)-propyl]-piperazin-1-yl}-acetamide
TypeSmall organic molecule
Emp. Form.C25H32N4O3S
Mol. Mass.468.612
SMILESCc1nc2cc(OC[C@H](O)CN3CCN(CC(=O)Nc4c(C)cccc4C)CC3)ccc2s1