Reaction Details
TargetMetabotropic glutamate receptor 2
LigandBDBM50034503
Substrate/Competitorn/a
Meas. Tech.ChEMBL_106201 (CHEMBL713191)
EC50 300±n/a nM
Citation Collado, IPedregal, CBueno, ABMarcos, AGonzález, RBlanco-Urgoiti, JPérez-Castells, JSchoepp, DDWright, RAJohnson, BGKingston, AEMoher, EDHoard, DWGriffey, KITizzano, JP (2S,1'S,2'R,3'R)-2-(2'-Carboxy-3'-hydroxymethylcyclopropyl) glycine is a highly potent group 2 and 3 metabotropic glutamate receptor agonist with oral activity. J Med Chem47:456-66 (2004) 
 
Metabotropic glutamate receptor 2
Name:Metabotropic glutamate receptor 2
Type:Enzyme
Mol. Mass.:95584.88
Organism:Homo sapiens (Human)
Description:Q14416
Residue:872
BDBM50034503
NameBDBM50034503
Synonyms:(1R,2R)-3-((S)-Amino-carboxy-methyl)-cyclopropane-1,2-dicarboxylic acid (2S,2'R,3'R)-2-(2',3')-dicarboxycyclopropylglycine CHEMBL284193 | DCG-IV
TypeSmall organic molecule
Emp. Form.C7H9NO6
Mol. Mass.203.1495
SMILESN[C@@H](C1[C@H]([C@@H]1C(O)=O)C(O)=O)C(O)=O