Reaction Details
TargetMetabotropic glutamate receptor 3
LigandBDBM50138784
Substrate/Competitorn/a
Meas. Tech.ChEMBL_106541 (CHEMBL714802)
Ki 3±n/a nM
Citation Collado, IPedregal, CBueno, ABMarcos, AGonzález, RBlanco-Urgoiti, JPérez-Castells, JSchoepp, DDWright, RAJohnson, BGKingston, AEMoher, EDHoard, DWGriffey, KITizzano, JP (2S,1'S,2'R,3'R)-2-(2'-Carboxy-3'-hydroxymethylcyclopropyl) glycine is a highly potent group 2 and 3 metabotropic glutamate receptor agonist with oral activity. J Med Chem47:456-66 (2004) 
 
Metabotropic glutamate receptor 3
Name:Metabotropic glutamate receptor 3
Type:Enzyme Catalytic Domain
Mol. Mass.:98889.09
Organism:Homo sapiens (Human)
Description:metabotropic glutamate 1c 0 HUMAN::Q14832
Residue:879
BDBM50138784
NameBDBM50138784
Synonyms:(1R,2S,3R)-2-((S)-Amino-carboxy-methyl)-3-hydroxy-cyclopropanecarboxylic acid | CHEMBL140197
TypeSmall organic molecule
Emp. Form.C6H9NO5
Mol. Mass.175.1394
SMILESN[C@@H]([C@H]1[C@@H](O)[C@@H]1C(O)=O)C(O)=O