Reaction Details
TargetIntegrin alpha-4/beta-1
LigandBDBM50139204
Substrate/Competitorn/a
Meas. Tech.ChEMBL_88912 (CHEMBL699814)
EC50>100000±n/a nM
Citation Vianello, PCozzi, PGalvani, AMeroni, MVarasi, MVolpi, DBandiera, T Solid-phase synthesis of a small library of 3-phenylthio-3-nicotinyl propionic acid derivatives acting as antagonists of the integrin alphaVbeta3. Bioorg Med Chem Lett14:657-61 (2004) Integrin alpha-4/beta-1
Name:Integrin alpha-4/beta-1
Type:n/a
Mol. Mass.:n/a
Description:ASSAY_ID of EBI is 88912
Components:This complex has 2 components.
Component 1
Name:Integrin beta-1
Synonyms:CD_antigen=CD29 Fibronectin receptor beta GPIIA ITGB1 MDF2 | MSK12
Type:Enzyme
Mol. Mass.:88400.38
Organism:Homo sapiens (Human)
Description:P05556
Residue:798
Component 2
Name:Integrin alpha-4
Synonyms:CD49 antigen-like family member D CD49d antigen ITA4_HUMAN Integrin alpha-4 Integrin alpha-IV VLA-4 integrin alpha 4 precursor | integrin alpha-4 precursor
Type:Membrane Protein
Mol. Mass.:114897.35
Organism:Homo sapiens (Human)
Description:P13612
Residue:1032
BDBM50139204
NameBDBM50139204
Synonyms:3-[4-(3-Guanidino-benzoylamino)-phenylsulfanyl]-3-pyridin-3-yl-propionic acid | CHEMBL350668
TypeSmall organic molecule
Emp. Form.C22H21N5O3S
Mol. Mass.435.499
SMILES[#7]\[#6](-[#7])=[#7]/c1cccc(c1)-[#6](=O)-[#7]-c1ccc(-[#16]-[#6](-[#6]-[#6](-[#8])=O)-c2cccnc2)cc1