Reaction Details
TargetHistamine H3 receptor
LigandBDBM50139346
Substrate/Competitorn/a
Meas. Tech.ChEBML_83645
Ki 8.6±n/a nM
Citation Gfesser, GAZhang, HDinges, JFox, GBPan, JBEsbenshade, TAYao, BBWitte, DMiller, TRKang, CHKrueger, KMBennani, YLHancock, AAFaghih, R Structure-activity relationships of non-imidazole H(3) receptor ligands. Part 3: 5-Substituted 3-phenyl-1,2,4-oxadiazoles as potent antagonists. Bioorg Med Chem Lett14:673-6 (2004) Histamine H3 receptor
Name:Histamine H3 receptor
Type:G Protein-Coupled Receptor (GPCR)
Mol. Mass.:48691.47
Organism:Homo sapiens (Human)
Description:Binding assays were using CHO cells stably expressing hH3R receptors.
Residue:445
BDBM50139346
NameBDBM50139346
Synonyms:CHEMBL158714 | Furan-2-carboxylic acid {(R)-2-[4-(3-{3-fluoro-4-[5-(3-methyl-butyl)-[1,2,4]oxadiazol-3-yl]-phenoxy}-propyl)-[1,4]diazepan-1-yl]-1-methyl-2-oxo-ethyl}-amide
TypeSmall organic molecule
Emp. Form.C29H38FN5O5
Mol. Mass.555.6409
SMILESCC(C)CCc1nc(no1)-c1ccc(OCCCN2CCCN(CC2)C(=O)[C@@H](C)NC(=O)c2ccco2)cc1F