Reaction Details
TargetHistamine H3 receptor
LigandBDBM50139322
Substrate/Competitorn/a
Meas. Tech.ChEBML_86753
Ki 2.3±n/a nM
Citation Gfesser, GAZhang, HDinges, JFox, GBPan, JBEsbenshade, TAYao, BBWitte, DMiller, TRKang, CHKrueger, KMBennani, YLHancock, AAFaghih, R Structure-activity relationships of non-imidazole H(3) receptor ligands. Part 3: 5-Substituted 3-phenyl-1,2,4-oxadiazoles as potent antagonists. Bioorg Med Chem Lett14:673-6 (2004) Histamine H3 receptor
Name:Histamine H3 receptor
Type:G Protein-Coupled Receptor (GPCR)
Mol. Mass.:48607.98
Organism:Rattus norvegicus (rat)
Description:n/a
Residue:445
BDBM50139322
NameBDBM50139322
Synonyms:1,6-Dihydro-pyridine-3-carboxylic acid [(R)-2-(4-{3-[3-fluoro-4-(5-phenyl-[1,2,4]oxadiazol-3-yl)-phenoxy]-propyl}-piperazin-1-yl)-1-methyl-2-oxo-ethyl]-amide | CHEMBL161279
TypeSmall organic molecule
Emp. Form.C30H31FN6O4
Mol. Mass.558.6033
SMILESC[C@@H](NC(=O)c1cccnc1)C(=O)N1CCN(CCCOc2ccc(-c3noc(n3)-c3ccccc3)c(F)c2)CC1