Reaction Details
TargetHistamine H3 receptor
LigandBDBM50139385
Substrate/Competitorn/a
Meas. Tech.ChEBML_83647
Ki 3.5±n/a nM
Citation Cowart, MPratt, JKStewart, AOBennani, YLEsbenshade, TAHancock, AA A new class of potent non-imidazole H(3) antagonists: 2-aminoethylbenzofurans. Bioorg Med Chem Lett14:689-93 (2004) Histamine H3 receptor
Name:Histamine H3 receptor
Type:G Protein-Coupled Receptor (GPCR)
Mol. Mass.:48691.47
Organism:Homo sapiens (Human)
Description:Binding assays were using CHO cells stably expressing hH3R receptors.
Residue:445
BDBM50139385
NameBDBM50139385
Synonyms:CHEMBL346562 | {4-[2-(2-Azepan-1-yl-ethyl)-benzofuran-5-yl]-phenyl}-morpholin-4-yl-methanone
TypeSmall organic molecule
Emp. Form.C27H32N2O3
Mol. Mass.432.5546
SMILESO=C(N1CCOCC1)c1ccc(cc1)-c1ccc2oc(CCN3CCCCCC3)cc2c1