Reaction Details
TargetHistamine H3 receptor
LigandBDBM50139389
Substrate/Competitorn/a
Meas. Tech.ChEBML_83647
Ki 0.954993±n/a nM
Citation Cowart, MPratt, JKStewart, AOBennani, YLEsbenshade, TAHancock, AA A new class of potent non-imidazole H(3) antagonists: 2-aminoethylbenzofurans. Bioorg Med Chem Lett14:689-93 (2004) Histamine H3 receptor
Name:Histamine H3 receptor
Type:G Protein-Coupled Receptor (GPCR)
Mol. Mass.:48691.47
Organism:Homo sapiens (Human)
Description:Binding assays were using CHO cells stably expressing hH3R receptors.
Residue:445
BDBM50139389
NameBDBM50139389
Synonyms:4-{2-[2-(2-Methyl-pyrrolidin-1-yl)-ethyl]-benzofuran-5-yl}-benzonitrile | CHEMBL161781
TypeSmall organic molecule
Emp. Form.C22H22N2O
Mol. Mass.330.4229
SMILESCC1CCCN1CCc1cc2cc(ccc2o1)-c1ccc(cc1)C#N