Reaction Details
TargetHistamine H3 receptor
LigandBDBM50139374
Substrate/Competitorn/a
Meas. Tech.ChEMBL_87053 (CHEMBL697326)
Ki 1.6±n/a nM
Citation Cowart, MPratt, JKStewart, AOBennani, YLEsbenshade, TAHancock, AA A new class of potent non-imidazole H(3) antagonists: 2-aminoethylbenzofurans. Bioorg Med Chem Lett14:689-93 (2004) Histamine H3 receptor
Name:Histamine H3 receptor
Type:G Protein-Coupled Receptor (GPCR)
Mol. Mass.:48607.98
Organism:Rattus norvegicus (rat)
Description:n/a
Residue:445
BDBM50139374
NameBDBM50139374
Synonyms:(6-{2-[2-((R)-2-Methyl-pyrrolidin-1-yl)-ethyl]-benzofuran-5-yl}-pyridin-3-yl)-morpholin-4-yl-methanone | CHEMBL159087
TypeSmall organic molecule
Emp. Form.C25H29N3O3
Mol. Mass.419.5161
SMILESC[C@@H]1CCCN1CCc1cc2cc(ccc2o1)-c1ccc(cn1)C(=O)N1CCOCC1