Reaction Details
TargetHistamine H3 receptor
LigandBDBM50139392
Substrate/Competitorn/a
Meas. Tech.ChEMBL_83797 (CHEMBL692573)
Ki 4±n/a nM
Citation Cowart, MPratt, JKStewart, AOBennani, YLEsbenshade, TAHancock, AA A new class of potent non-imidazole H(3) antagonists: 2-aminoethylbenzofurans. Bioorg Med Chem Lett14:689-93 (2004) Histamine H3 receptor
Name:Histamine H3 receptor
Type:G Protein-Coupled Receptor (GPCR)
Mol. Mass.:48691.47
Organism:Homo sapiens (Human)
Description:Binding assays were using CHO cells stably expressing hH3R receptors.
Residue:445
BDBM50139392
NameBDBM50139392
Synonyms:CHEMBL422360 | Morpholin-4-yl-{6-[2-(2-pyrrolidin-1-yl-ethyl)-benzofuran-5-yl]-pyridin-3-yl}-methanone
TypeSmall organic molecule
Emp. Form.C24H27N3O3
Mol. Mass.405.4895
SMILESO=C(N1CCOCC1)c1ccc(nc1)-c1ccc2oc(CCN3CCCC3)cc2c1