Reaction Details
TargetHistamine H3 receptor
LigandBDBM50139388
Substrate/Competitorn/a
Meas. Tech.ChEMBL_83647 (CHEMBL693107)
Ki 2.3±n/a nM
Citation Cowart, MPratt, JKStewart, AOBennani, YLEsbenshade, TAHancock, AA A new class of potent non-imidazole H(3) antagonists: 2-aminoethylbenzofurans. Bioorg Med Chem Lett14:689-93 (2004) Histamine H3 receptor
Name:Histamine H3 receptor
Type:G Protein-Coupled Receptor (GPCR)
Mol. Mass.:48691.47
Organism:Homo sapiens (Human)
Description:Binding assays were using CHO cells stably expressing hH3R receptors.
Residue:445
BDBM50139388
NameBDBM50139388
Synonyms:CHEMBL159565 | Morpholin-4-yl-{4-[2-(2-piperidin-1-yl-ethyl)-benzofuran-5-yl]-phenyl}-methanone
TypeSmall organic molecule
Emp. Form.C26H30N2O3
Mol. Mass.418.528
SMILESO=C(N1CCOCC1)c1ccc(cc1)-c1ccc2oc(CCN3CCCCC3)cc2c1