Reaction Details
TargetCathepsin K
LigandBDBM50084655
Substrate/Competitorn/a
Meas. Tech.ChEBML_45550
IC50 0.110000±n/a nM
Citation Catalano, JGDeaton, DNLong, STMcFadyen, RBMiller, LRPayne, JAWells-Knecht, KJWright, LL Design of small molecule ketoamide-based inhibitors of cathepsin K. Bioorg Med Chem Lett14:719-22 (2004) Cathepsin K
Name:Cathepsin K
Type:Enzyme
Mol. Mass.:36975.68
Organism:Homo sapiens (Human)
Description:P43235
Residue:329
BDBM50084655
NameBDBM50084655
Synonyms:CHEMBL92708 Z-Leu-Nle-CHO [1-((S)-(S)-1-Formyl-pentylcarbamoyl)-3-methyl-butyl]-carbamic acid benzyl ester [1-(1-Formyl-pentylcarbamoyl)-3-methyl-butyl]-carbamic acid benzyl ester(calpeptin) | benzyl (S)-4-methyl-1-oxo-1-((S)-1-oxohexan-2-ylamino)pentan-2-ylcarbamate
TypeSmall organic molecule
Emp. Form.C20H30N2O4
Mol. Mass.362.4632
SMILESCCCC[C@H](NC(=O)[C@H](CC(C)C)NC(=O)OCc1ccccc1)C=O