Reaction Details
TargetCoagulation factor X
LigandBDBM50140386
Substrate/Competitorn/a
Meas. Tech.ChEMBL_48641 (CHEMBL659621)
IC50 2±n/a nM
Citation Jia, ZJWu, YHuang, WZhang, PClizbe, LAGoldman, EASinha, UArfsten, AEEdwards, STAlphonso, MHutchaleelaha, AScarborough, RMZhu, BY 1-(2-Naphthyl)-1H-pyrazole-5-carboxylamides as potent factor Xa inhibitors. Part 2: A survey of P4 motifs. Bioorg Med Chem Lett14:1221-7 (2004) 
 
Coagulation factor X
Name:Coagulation factor X
Type:Enzyme
Mol. Mass.:54726.60
Organism:Homo sapiens (Human)
Description:n/a
Residue:488
BDBM50140386
NameBDBM50140386
Synonyms:2-(6-Chloro-naphthalen-2-yl)-5-methyl-2H-pyrazole-3-carboxylic acid (2'-dimethylaminomethyl-3-fluoro-biphenyl-4-yl)-amide | CHEMBL277949
TypeSmall organic molecule
Emp. Form.C30H26ClFN4O
Mol. Mass.513.005
SMILESCN(C)Cc1ccccc1-c1ccc(NC(=O)c2cc(C)nn2-c2ccc3cc(Cl)ccc3c2)c(F)c1