Reaction Details
TargetCoagulation factor X
LigandBDBM50140356
Substrate/Competitorn/a
Meas. Tech.ChEMBL_48792 (CHEMBL662445)
Ki 1.8±n/a nM
Citation Jia, ZJWu, YHuang, WZhang, PClizbe, LAGoldman, EASinha, UArfsten, AEEdwards, STAlphonso, MHutchaleelaha, AScarborough, RMZhu, BY 1-(2-Naphthyl)-1H-pyrazole-5-carboxylamides as potent factor Xa inhibitors. Part 2: A survey of P4 motifs. Bioorg Med Chem Lett14:1221-7 (2004) 
 
Coagulation factor X
Name:Coagulation factor X
Type:Enzyme
Mol. Mass.:54726.60
Organism:Homo sapiens (Human)
Description:n/a
Residue:488
BDBM50140356
NameBDBM50140356
Synonyms:2-(6-Chloro-naphthalen-2-yl)-5-methyl-2H-pyrazole-3-carboxylic acid (3-fluoro-2'-methanesulfonyl-biphenyl-4-yl)-amide | CHEMBL20536
TypeSmall organic molecule
Emp. Form.C28H21ClFN3O3S
Mol. Mass.534.001
SMILESCc1cc(C(=O)Nc2ccc(cc2F)-c2ccccc2S(C)(=O)=O)n(n1)-c1ccc2cc(Cl)ccc2c1